Algemeen
type: Concept
created: 2025-02-23T17:10:30+00:00
id: 2957638
is public: true
item set: b003vhg
owner: https://www.goudatijdmachine.nl/omeka/api/users/2
resource class: https://www.goudatijdmachine.nl/omeka/api/resource_classes/3013
resource template: https://www.goudatijdmachine.nl/omeka/api/resource_templates/80
site: https://www.goudatijdmachine.nl/omeka/api/sites/2
title: Algemeen
broader: b003vqz
definition: Niet in één van de andere rubrieken onder belasting te vatten bronnen.
in scheme: b003vk9
sd date published: 2025-02-23T17:11:43+00:00