Klap- en lantaarngeld
is public: true
id: 2956607
title: Klap- en lantaarngeld
definition: Klap- en lantaarngeld zijn specifieke vormen van stedelijke belastingen die werden geheven om de kosten van openbare veiligheid en stedelijke voorzieningen te dekken, in het bijzonder de nachtwacht en de straatverlichting. Het klapgeld diende voor de betaling van de nachtwakers (ook wel klapwakers genoemd naar de houten 'klapper' waarmee zij de tijd aangaven of alarm sloegen), terwijl het lantaarngeld werd aangewend voor de aanschaf, het onderhoud en de brandstof van openbare straatlantaarns. De hoogte van de aanslag werd vaak berekend op basis van de breedte van de voorgevel van een pand of de getaxeerde waarde ervan, waardoor deze registers een zeer gedetailleerd beeld geven van de bebouwing in een straat. Doordat de bijbehorende leggers, kasboeken en kohieren nauwgezet bijhielden welke gebouwen nieuw waren opgetrokken, welke panden tijdelijke belastingvrijstelling genoten en hoe breed de individuele huizen waren, vormen ze een onmisbare bron voor zowel sociaal-economisch onderzoek als voor de reconstructie van het historische stadsbeeld.
type: Concept
item set: b003vhg
in scheme: b003vk9
broader: b003vqz
resource class: https://www.goudatijdmachine.nl/omeka/api/resource_classes/3013
resource template: https://www.goudatijdmachine.nl/omeka/api/resource_templates/80
site: https://www.goudatijdmachine.nl/omeka/api/sites/2
owner: https://www.goudatijdmachine.nl/omeka/api/users/2
created: 2025-01-27T16:12:45+00:00
sd date published: 2026-03-28T17:33:24+00:00