Gaderboeken van de accijns op turf en kolen
type: Concept
created: 2025-01-26T14:36:52+00:00
id: 2956584
is public: true
item set: b003vhg
owner: https://www.goudatijdmachine.nl/omeka/api/users/2
resource class: https://www.goudatijdmachine.nl/omeka/api/resource_classes/3013
resource template: https://www.goudatijdmachine.nl/omeka/api/resource_templates/80
site: https://www.goudatijdmachine.nl/omeka/api/sites/2
title: Gaderboeken van de accijns op turf en kolen
broader: b003vqz
definition: Gaderboeken van de accijns op turf en kolen fungeren als de gedetailleerde inningsregisters van indirecte belastingen op de belangrijkste brandstoffen van weleer. In deze boeken hielden de belastingontvangers of pachters (de 'gaders') nauwgezet bij welke hoeveelheden turf en kolen de gemeenschap binnenkwamen en welk bedrag aan accijns daarover werd afgedragen aan de lokale schatkist. Omdat deze brandstoffen essentieel waren voor zowel huishoudelijke verwarming als voor brandstofintensieve industrieën, bieden deze registers een scherp inzicht in de lokale economische bedrijvigheid en het dagelijkse energieverbruik van de bevolking. Deze bron gaat vaak gepaard met juridische documenten, zoals verpachtingsvoorwaarden of besluiten over belastingvrijstellingen voor specifieke groepen, waardoor het niet alleen een financiële administratie is, maar ook een weerspiegeling van de bestuurlijke en juridische machtsverhoudingen rondom de handel in vitale levensbehoeften.
in scheme: b003vk9
sd date published: 2026-03-28T17:28:29+00:00