Certificatieboeken
is public: true
id: 2956583
title: Certificatieboeken
definition: Certificatieboeken zijn ambtelijke registers waarin verklaringen en getuigenissen werden opgetekend die ten overstaan van de lokale overheid, vaak de schepenen, waren afgelegd. Deze 'certificaties' dienden als officieel bewijsstuk voor uiteenlopende zaken, zoals iemands goede naam en faam, geboorteplaats, afkomst of burgerlijke staat. Burgers lieten dergelijke akten vaak opmaken wanneer zij naar een andere stad verhuisden of betrokken waren bij juridische geschillen en zakelijke transacties waarbij een formeel bewijs van betrouwbaarheid of identiteit vereist was.
type: Concept
item set: b003vhg
in scheme: b003vk9
broader: b00440n
resource class: https://www.goudatijdmachine.nl/omeka/api/resource_classes/3013
resource template: https://www.goudatijdmachine.nl/omeka/api/resource_templates/80
site: https://www.goudatijdmachine.nl/omeka/api/sites/2
owner: https://www.goudatijdmachine.nl/omeka/api/users/2
created: 2025-01-26T14:02:14+00:00
sd date published: 2026-03-28T17:20:22+00:00