200e en 100e penning
type: Concept
created: 2025-01-25T18:07:14+00:00
id: 2956552
is public: true
item set: b003vhg
owner: https://www.goudatijdmachine.nl/omeka/api/users/2
resource class: https://www.goudatijdmachine.nl/omeka/api/resource_classes/3013
resource template: https://www.goudatijdmachine.nl/omeka/api/resource_templates/80
site: https://www.goudatijdmachine.nl/omeka/api/sites/2
title: 200e en 100e penning
broader: b003vqz
definition: De 200e en 100e penning zijn vermogensbelastingen van de landsheer. Ik kan er niet achter komen wanneer met deze belasting een begin is gemaakt. Het archief bewaart kwitanties van de 100e penning uit 1575, maar dat lijkt een geïsoleerd jaar. Dan volgt met onderbrekingen de 200e penning (1599, 1602, 1625, 1628, 1631, 1635, 1638, 1644, 1646, 1652, 1653, 1659). Van 1664 tot 1669 en van 1672 tot 1689 lijkt er jaarlijks te worden geïnd. In 1689 gaat men over op het innen van de 100e penning, wat neer lijkt te komen op een verdubbeling van de lasten. De inning gaat (jaarlijks?) door tot 1721. In 1722 lijkt nog één keer een 200e penning te zijn geïnd. De kohieren, leggers etc. bevatten veel namen die gebruikt kunnen worden bij het lokaliseren van personen: er wordt van huis tot huis geadministreerd.
in scheme: b003vk9
related: b003vvm
scope note: Ik heb van alle penning-archivalia een apart Excel-bestand gemaakt op jaar. Dat geeft een goed beeld van wat er per jaar is.
sd date published: 2025-01-25T18:09:32+00:00