Verponding
type: Concept
created: 2025-01-25T18:05:49+00:00
id: 2956551
is public: true
item set: b003vhg
owner: https://www.goudatijdmachine.nl/omeka/api/users/2
resource class: https://www.goudatijdmachine.nl/omeka/api/resource_classes/3013
resource template: https://www.goudatijdmachine.nl/omeka/api/resource_templates/80
site: https://www.goudatijdmachine.nl/omeka/api/sites/2
title: Verponding
broader: b003vqz
definition: De verponding was een van de belangrijkste en meest constante vormen van onroerendgoedbelasting, waarbij eigenaren van huizen, landerijen en andere gebouwen een percentage van de (geschatte) huurwaarde van hun bezit aan de overheid afdroegen. In tegenstelling tot belastingen op handel of consumptie, bood de verponding een stabiele inkomstenbron die gebaseerd was op het tastbare bezit; zelfs als een eigenaar zijn eigen pand bewoonde, werd er een fictieve huurwaarde vastgesteld om de hoogte van de aanslag te bepalen. De administratie hiervan bestond uit kohieren (de aanslaglijsten), gaderboeken (waarin de feitelijke inning werd bijgehouden) en verslagen van het zogenaamde redres, een periodieke herwaardering waarbij de belastbare waarde werd aangepast aan de actuele staat van de gebouwen.
in scheme: b003vk9
top concept of: b003vk9
sd date published: 2026-03-28T17:34:35+00:00