Hofstedegeld
type: Concept
created: 2025-01-25T18:04:54+00:00
id: 2956550
is public: true
item set: b003vhg
owner: https://www.goudatijdmachine.nl/omeka/api/users/2
resource class: https://www.goudatijdmachine.nl/omeka/api/resource_classes/3013
resource template: https://www.goudatijdmachine.nl/omeka/api/resource_templates/80
site: https://www.goudatijdmachine.nl/omeka/api/sites/2
title: Hofstedegeld
broader: b003vqz
definition: Hofstedegeld is een eeuwenoude vorm van grondbelasting die werd geheven op de 'hofstede': het perceel of de grond waarop een huis, boerderij of ander bouwwerk was gevestigd. In tegenstelling tot incidentele belastingen was dit vaak een vaste, jaarlijkse last die onlosmakelijk met de grond verbonden bleef, waardoor de bijbehorende leggers en kohieren een ongekende continuïteit bieden voor historisch onderzoek. Deze registers bevatten systematische lijsten van eigenaren en gebruikers (debiteuren), vaak gerangschikt per wijk of straat, en tonen hoe de betalingsverplichting – en daarmee het bezit – door de eeuwen heen werd overgedragen.
in scheme: b003vk9
top concept of: b003vk9
sd date published: 2026-03-28T17:30:49+00:00