spruce (wood)
type: Concept
broader: https://data.rkd.nl/thesaurus/95027
in scheme: MATERTECHN
in scheme: WOOD TYPE
notation: 91146
preferred label: sparrenhout @nl
scope note: Wood from any of the species of evergreen spruce trees, forming the genus Picea.
generated at time: 2021-10-19T15:06:54+00:00