Byblos
type: Thing
type: Concept
main entity of page: https://data.bibliotheken.nl/.well-known/genid/ec3e2cc82f02d2a898e20dd3895b41d5
broader: p075632187
in scheme: brinkman
scope note: Byblos (Grieks: Βύβλος; Assyrisch: Gubla; Arabisch: Jubail) is een historische Fenicische havenstad in het huidige Libanon. De stad ligt ten noorden van Beiroet aan de Middellandse Zee. (Bron: Wikipedia)