Harran
type: Thing
type: Concept
main entity of page: https://data.bibliotheken.nl/.well-known/genid/f1e16214f5eb1043399d0d8e88079045
alternative label: Charan
alternative label: Carrhae
alternative label: Haran
broader: p075633825
in scheme: brinkman
scope note: Harran, in de Hebreeuwse Bijbel Haran of Charan (Hebreeuws: חָרָן, Ḥārān) genoemd en in de Romeinse geschiedschrijving bekend als Carrhae, is een historische stad in de provincie Şanlıurfa in het zuidoosten van Turkije bij de grens met Syrië, 44 kilometer ten zuidoosten van de stad Şanlıurfa. (Wikipedia)