Noord-Macedonië
type: Thing
type: Concept
main entity of page: https://data.bibliotheken.nl/.well-known/genid/3a9a910dfad30acb749f5e2fd94f8f4c
alternative label: Republiek Noord-Macedonië
in scheme: brinkman
related: p168352192
scope note: Sinds februari 2019 heet het land officieel Noord-Macedonië.