Heerendijk
type: Thing
type: Concept
main entity of page: https://data.bibliotheken.nl/.well-known/genid/8889c4248c3b21ae0397c12c0f66d803
broader: p07563418X
in scheme: brinkman
scope note: plaats in het district Commewijne (Suriname)