Máximakanaal
type: Thing
type: Concept
main entity of page: https://data.bibliotheken.nl/.well-known/genid/a51a5cb9452faf4a95b3b8428154e8c7
broader: p075632845
in scheme: brinkman
scope note: Nieuw aangelegde vaarweg in Noord-Brabant als zijnde een 'omlegging van de Zuid-Willemsvaart Maas-Den Dungen'