Barr Al Hikman
type: Thing
type: Concept
main entity of page: https://data.bibliotheken.nl/.well-known/genid/df06f13a5992cf48028fe4809b06fbbc
broader: p075655659
in scheme: brinkman
scope note: Bibliografisch nummer 28936257: waddengebied in het oosten van het Sultanaat van Oman