Katlijker Schar
type: Thing
type: Concept
main entity of page: https://data.bibliotheken.nl/.well-known/genid/750980091a666df5a21899e5a2fcf4b4
alternative label: Ketliker Skar
broader: p075630796
in scheme: brinkman
scope note: Ketliker Skar ligt in het dal van De Tsjonger of De Kuunder en maakt deel uit van de buitengebieden van de dorpen Katlijk, Nieuwehorne, Nijeholtpade, Ter Idzard, Oldeholtwolde en Oldeberkoop