Palenque de San Basilio
type: Thing
type: Concept
main entity of page: https://data.bibliotheken.nl/.well-known/genid/8c44ea76bbf716ac8fd539e1812a95d5
broader: p075613581
in scheme: brinkman
scope note: Kortweg "Palenque"
scope note: Palenque de San Basilio is een dorp bij de Montes de María, nabij Cartagena in Colombia