Moerbeek
type: Thing
type: Concept
main entity of page: https://data.bibliotheken.nl/.well-known/genid/961bb9866b3a273441f457c78bec9968
broader: p075632861
in scheme: brinkman
scope note: 25-10-17: bron https://nl.wikipedia.org/wiki/Moerbeek Moerbeek is een buurtschap in de gemeente Hollands Kroon in de provincie Noord-Holland.