Landgoed De Eese
type: Thing
type: Concept
main entity of page: https://data.bibliotheken.nl/.well-known/genid/901056ff20c3cefecb82b54e646c4380
alternative label: De Eese, Landgoed
alternative label: Eese, de (Landgoed)
alternative label: Landgoed Heerlijkheid De Eese
broader: p33599380X
in scheme: brinkman
scope note: De Eese (ook 'De Ehze') is een landgoed met havezate, grotendeels gelegen in de uiterste noordoosthoek van de Overijsselse gemeente Steenwijkerland met verder een klein deel in de Drentse gemeente Westerveld en nog een heel klein deel in de Friese gemeente Weststellingwerf.