Sterrenburg (Dordrecht)
type: Thing
type: Concept
main entity of page: https://data.bibliotheken.nl/.well-known/genid/2100d4eb72e4b550adcf711925d44573
broader: p075637367
in scheme: brinkman
scope note: Sterrenburg is een stadswijk van Dordrecht, gelegen in het zuiden