Golf van Cádiz
type: Thing
type: Concept
main entity of page: https://data.bibliotheken.nl/.well-known/genid/276f8e773ee1bf3a08e24f70155c4f24
alternative label: Gulf of Cádiz
alternative label: Golfo de Cádiz
in scheme: brinkman
scope note: Wikipedia: "De Golf van Cádiz is een baai van de Atlantische Oceaan die zich uitstrekt van de Andalusische havenstad Cádiz tot de Cabo de Santa Maria bij de Portugese stad Faro"