Auvergnepolder
type: Thing
type: Concept
main entity of page: https://data.bibliotheken.nl/.well-known/genid/bda61ac561d8f591b417a8fbff26d692
broader: p075632845
in scheme: brinkman
scope note: De Auvergnepolder is een polder en voormalig waterschap ten westen van Halsteren, die aangelegd is op slikken aan de Brabantse kant van de Eendracht.