Beemte Broekland
type: Thing
type: Concept
main entity of page: https://data.bibliotheken.nl/.well-known/genid/f1a441958d02eff1e0d16f5029cd780c
broader: p075638703
in scheme: brinkman
scope note: gehucht gelegen in de gemeente Apeldoorn