Akerendam
type: Thing
type: Concept
main entity of page: https://data.bibliotheken.nl/.well-known/genid/4bd8fc11fc8fbd033a053a7745a6fd55
alternative label: Buitenplaats Akerendam
alternative label: Landgoed Akerendam
broader: p075636417
in scheme: brinkman
scope note: "De buitenplaats Akerendam ligt tegenwoordig in de bebouwde kom van Beverwijk."
scope note: Wikipedia: "Akerendam is een landgoed in Beverwijk."