Constantinopel
type: Thing
type: Concept
main entity of page: https://data.bibliotheken.nl/.well-known/genid/78741ce0d8b296137a9e53798a3c3626
in scheme: brinkman
related: p075690144
scope note: van ca. 330 tot 1453. Hiervoor: Byzantium, erna: Istanbul