Bodegraven Reeuwijk
type: Thing
type: Concept
main entity of page: https://data.bibliotheken.nl/.well-known/genid/675e47729ddcd723b94ea5891b9b7bb4
alternative label: Bodegraven-Reeuwijk
broader: p075634686
in scheme: brinkman
related: p075629968
related: p075687526
scope note: Per 1-1-2011 is de gemeente ontstaan uit een fusie van de gemeenten 'Bodegraven' en 'Reeuwijk'