Andamanen
type: Thing
type: Concept
main entity of page: https://data.bibliotheken.nl/.well-known/genid/1ee24ef7952560ba786d33e75f5a1826
broader: p075631210
in scheme: brinkman
scope note: De Andamanen zijn een eilandengroep in de Golf van Bengalen. Zij behoren tot India en zijn een onderdeel van het unieterritorium van de Andamanen en Nicobaren, waarvan de hoofdstad Port Blair is.