Eurazië
type: Thing
type: Concept
main entity of page: https://data.bibliotheken.nl/.well-known/genid/453994056941a660dbb640f2bbb6e86b
in scheme: brinkman
scope note: Eurazië is de naam van de grootste landmassa op aarde en is een supercontinent dat de continenten Europa en Azië omvat