Maaskantje
type: Thing
type: Concept
main entity of page: https://data.bibliotheken.nl/.well-known/genid/d11fe21a27cb76f283c35a10398c508c
broader: p075632845
in scheme: brinkman
scope note: Maaskantje is een dorp in de Nederlandse provincie Noord-Brabant. Het behoort tot de gemeente Sint-Michielsgestel