Oosterwold (Almere)
type: Thing
type: Concept
main entity of page: https://data.bibliotheken.nl/.well-known/genid/2ef1f70853cb1370ce7a297828f47141
broader: p075629453
in scheme: brinkman
scope note: Opgebouwd uit de kernen van Almere Hout Noord en Midden en de nieuwe Almere Eemvallei