Arkemheen-Eemland
type: Thing
type: Concept
main entity of page: https://data.bibliotheken.nl/.well-known/genid/cdad139b9ff4faf009955cd2a432bf1f
broader: p075638703
broader: p075633922
in scheme: brinkman
related: p153407484
scope note: Het nationale landschap ligt deels in de provincie Utrecht (Eemland) en deels in de provincie Gelderland (polder Arkemheen), ingeklemd tussen de Randmeren en Amersfoort
scope note: http://nl.wikipedia.org/wiki/Nationaal_Landschap_Arkemheen-Eemland