Maasheggen
type: Thing
type: Concept
main entity of page: https://data.bibliotheken.nl/.well-known/genid/74bf6e6872d7b902c13bee814e571a35
alternative label: Maasheggengebied
broader: p075632845
in scheme: brinkman
scope note: Natuurgebied. Heggenlandschap in de uiterwaarden van de Maas. Strekt zich uit van Cuijk tot Maashees in Oost Noord-Brabant en van Middelaar tot Well in Noord-Limburg. Ligt grotendeels in de gemeente Boxmeer