Kromme Does
type: Thing
type: Concept
main entity of page: https://data.bibliotheken.nl/.well-known/genid/406124b04680087e9e98b479388ecf5c
alternative label: Does, Kromme
broader: p075634686
in scheme: brinkman
scope note: Nabij Hoogmade, gemeente Kaag en Braassem, ZH