Ralstonia solanacearum
type: Concept
main entity of page: https://koninklijkebibliotheek.triply.cc/.well-known/genid/967256237a480c834a36a8cd7b76a7f4
main entity of page: http://data.bibliotheken.nl/doc/thes/p329475967
broader: p078629209
editorial note: Website Europa nu
editorial note: GOO-thesaurusbeheer
in scheme: gtt
scope note: Organisme, schadelijk voor aardappel- en tomatenteelt