Westeraam (Overbetuwe)
type: Thing
type: Concept
main entity of page: https://data.bibliotheken.nl/.well-known/genid/5364291155c2d0c8f1ca60dcbacae499
broader: p276824210
in scheme: brinkman
scope note: Gemeente Overbetuwe
scope note: Wikipedia: "De Westeraam is een nieuwbouwwijk ten oosten van Elst (Gelderland) (gemeente Overbetuwe). Deze wijk ligt ten westen van het gehucht Aam, en ten noorden van het daarnaar vernoemde industrie-/bedrijvengebied De Aam. Een deel van de wijk (Groenoord) is in juni 2006 gereed gekomen. De andere delen van de wijk zijn nog in ontwikkeling,.."