Scenotest
type: Concept
main entity of page: https://koninklijkebibliotheek.triply.cc/.well-known/genid/59e89e913d946825b002a99cf52904a7
main entity of page: http://data.bibliotheken.nl/doc/thes/p322614058
alternative label: Von Staabs-test
broader: p095982000
editorial note: Testtheorie / P. Drent
editorial note: Een meer recente bron voor 911 is welkom
editorial note: GOO-thesaurusbeheer
in scheme: gtt
preferred label: Sceno test @en
scope note: Testmethode voor emotionele problemen bij kinderen