Landerd
type: Thing
type: Concept
main entity of page: https://data.bibliotheken.nl/.well-known/genid/6861314e38b7a54e4c25ff366bae9182
broader: p075632845
in scheme: brinkman
scope note: gemeente in Noord-brabant <http://nl.wikipedia.org/wiki/Landerd>