Multitasking
type: Concept
main entity of page: http://data.bibliotheken.nl/doc/thes/p320475999
main entity of page: https://koninklijkebibliotheek.triply.cc/.well-known/genid/a9f926d5aace4f9a9151cba9ff73d0b4
editorial note: GOO-thesaurusbeheer
editorial note: VD 14
in scheme: gtt
related: p078636183
scope note: Het gelijktijdig verrichten van verschillende taken door een apparaat of organisatie