Thuisonderwijs
type: Concept
main entity of page: http://data.bibliotheken.nl/doc/thes/p317041339
main entity of page: https://koninklijkebibliotheek.triply.cc/.well-known/genid/964416b6dc09120a51dde3f4e6eed21c
alternative label: Home tuition @en
broader: p078610141
editorial note: GOO-thesaurusbeheer
editorial note: Notebook : Nederlandse en Vlaamse onderwijstermen in het Engels / Kees Broekhof
in scheme: gtt
preferred label: Distance learning @en
scope note: Onderwijs dat men thuis via b.v. de pc volgt