Equiprobabilisme
type: Concept
main entity of page: http://data.bibliotheken.nl/doc/thes/p315255072
main entity of page: https://koninklijkebibliotheek.triply.cc/.well-known/genid/18d41b4c265e1c9439367a234cae7efd
editorial note: GOO-thesaurusbeheer
editorial note: WP9, zie onder: Moraalsysteem
in scheme: gtt
preferred label: Aequiprobabilism @en
related: p078595592
scope note: Begrip uit de rooms-katholieke moraaltheologie