Oostkantons
type: Thing
type: Concept
main entity of page: https://data.bibliotheken.nl/.well-known/genid/76ed0581c8e2f1caff920721b1c21e39
broader: p075629720
in scheme: brinkman
scope note: de kantons Eupen, Malmédy en Sankt Vith in de provincie Luik