Lansingerland
type: Thing
type: Concept
main entity of page: https://data.bibliotheken.nl/.well-known/genid/eb95f8a50cdcbfbfbf3e4b75edfa578f
broader: p075634686
in scheme: brinkman
scope note: Lansingerland is de gemeente die op 1 januari 2007 is ontstaan uit de fusie van Berkel en Rodenrijs, Bleiswijk en Bergschenhoek in de Nederlandse provincie Zuid-Holland