Bargeres (Emmen)
type: Thing
type: Concept
main entity of page: https://data.bibliotheken.nl/.well-known/genid/6ccfc748e6c414087bdb4c82fa7fcf75
broader: p075613522
in scheme: brinkman
scope note: Bargeres is een woonwijk ten zuiden van het centrum van Emmen in de provincie Drenthe