Zuna
type: Thing
type: Concept
main entity of page: https://data.bibliotheken.nl/.well-known/genid/1f343404dbd97cd42cedd7c37be1ea66
broader: p075633159
in scheme: brinkman
scope note: buurtschap aan de Regge in de gemeente Wierden