Mariapeel
type: Thing
type: Concept
main entity of page: https://data.bibliotheken.nl/.well-known/genid/4e04634245b43c1dfa60e9501def20e5
broader: p075632209
in scheme: brinkman
scope note: De Mariapeel is een hoogveen-achtig natuurgebied in de gemeente Horst aan de Maas in de Nederlandse provincie Limburg.