Bargerveen
type: Thing
type: Concept
main entity of page: https://data.bibliotheken.nl/.well-known/genid/e81bf4b48ad9e1889f4644db15b2209a
broader: p075613522
in scheme: brinkman
scope note: Het Bargerveen is een natuurgebied van Staatsbosbeheer in de gemeente Emmen, provincie Drenthe