Dordtsche Kil
type: Thing
type: Concept
main entity of page: https://data.bibliotheken.nl/.well-known/genid/3d4942a262891ae13b0b9556804c89fc
alternative label: Dordtse Kil
broader: p075634686
in scheme: brinkman
scope note: De Dordtsche Kil is een getijrivier in de provincie Zuid-Holland die de Oude Maas verbindt met het Hollandsch Diep en de Hoeksche Waard scheidt van het Eiland van Dordrecht. Tevens vormt de rivier de gemeentegrens tussen Dordrecht en Binnenmaas.