Fondsen (instellingen)
type: Concept
main entity of page: http://data.bibliotheken.nl/doc/thes/p297798170
main entity of page: https://koninklijkebibliotheek.triply.cc/.well-known/genid/8d4b540a3648962d51f88e981a6dd47e
editorial note: GOO-thesaurusbeheer
editorial note: Niet verwarren met Fondsenwerving e.d.; het gaat hier om de corporaties, niet om de activiteit van het verwerven van gelden
editorial note: VD13
in scheme: gtt
preferred label: Funds (institutes) @en
scope note: Instellingen die geldelijke middelen verwerven