Amniota
type: Concept
main entity of page: https://koninklijkebibliotheek.triply.cc/.well-known/genid/89f6702e31c249e51a553156661cd87b
main entity of page: http://data.bibliotheken.nl/doc/thes/p291082904
editorial note: Website Taxonomy
editorial note: GOO-thesaurusbeheer
editorial note: Lexikon der Biologie; WP9
editorial note: Volgens WP een weinig gebruikte benaming voor de drie hoogste klassen van de gewervelde dieren
in scheme: gtt
related: p078942748
scope note: Gewervelde dieren waarbij het embryo omgeven is door vruchtvliezen (Zoogdieren, vogels en reptielen)