Kerkbuurt
type: Thing
type: Concept
main entity of page: https://data.bibliotheken.nl/.well-known/genid/e0064758fb814cc75bf66adc2e6e695e
broader: p075632861
in scheme: brinkman
scope note: en een Kerkbuurt Buurtschap in de gemeente Sciedam
scope note: gemeente Andijk. Let op er is ook een "Kerkbuurt' in de gemeente Harenkarspel!!!!!!!!!!