Using (volk)
type: Concept
editorial note: Ensiklopedi suku bangsa di Indonesia, 1997 / Zulyani Hidayah
editorial note: GOO-thesaurusbeheer
main entity of page: https://koninklijkebibliotheek.triply.cc/.well-known/genid/8526e0b670537265b51090bcfb51c6fb
main entity of page: http://data.bibliotheken.nl/doc/thes/p267318073
alternative label: Osing
broader: p078551595
in scheme: gtt
preferred label: Using (people) @en
scope note: Ethnische groep (suku) in residentie Banyuwangi (Oost-Java)